{"text_format":"3","workbook":"xlsx","n_sheets":3,"sheets":["Instructions","Customer Info","OrderForm"],"not_rendered":{"images":3,"macros":1,"defined_names":4},"read":"whole","date_system":"1900"}

{"sheet":"Instructions","index":0,"n_rows":11,"n_cols":2,"rows_kept":11,"merged":[[0,0,0,1],[1,0,1,1]]}
["Using the Order Form"]
["Step by Step"]
[1,"Open F22 Order Form"]
[2,"When prompted click Enable Macros"]
[3,"Click the Customer Info tab (adjacent to instructions tab)"]
[4,"Enter your store information (yellow areas)"]
[5,"If the shipping address is the same as the billing address click the Copy to Ship to button. Otherwise  manually enter the ship to address in the ship to address box."]
[6,"Input your PO # and ship date for each ship month"]
[7,"Click the Order Form tab (adjacent to Customer Info tab) to open the order form."]
[8,"Enter your order using the appropriate column for each ship month."]
[10,"Once you have completed entering your order save the file as your store name.xlsm (ex. Outdoorshop.xlsm) - please save as a macro enabled workbook!"]

{"sheet":"Customer Info","index":1,"n_rows":57,"n_cols":2,"rows_kept":57,"merged":[[0,0,0,2],[1,0,1,2],[2,0,2,2],[3,0,3,1],[4,0,4,2],[5,1,5,2],[6,1,6,2],[7,1,7,2],[8,1,8,2],[9,1,9,2],[11,0,11,2],[12,1,12,2],[13,1,13,2],[14,1,14,2],[15,1,15,2],[16,1,16,2],[17,1,17,2],[20,1,20,2],[21,1,21,2],[22,1,22,2],[23,1,23,2],[24,1,24,2],[26,1,26,2],[27,1,27,2],[28,1,28,2],[29,1,29,2],[30,1,30,2],[32,1,32,2],[33,1,33,2],[34,1,34,2],[35,1,35,2],[36,1,36,2],[38,1,38,2],[39,1,39,2],[40,1,40,2],[41,1,41,2],[42,1,42,2],[44,1,44,2],[45,1,45,2],[46,1,46,2],[47,1,47,2],[48,1,48,2],[50,1,50,2],[51,1,51,2],[52,1,52,2],[53,1,53,2],[55,1,55,2],[56,1,56,2]]}
["Mountainsmith Fall 2022 PRSN"]
["Valid on Shipments"]
["7/15/2022-12/31/2022"]
["Customer Name:"]
["Bill to address:"]
["Street/Box #"]
["Suite/Unit #"]
["City"]
["State"]
["Zip Code"]
[]
["Ship to address:"]
["Store Name"]
["Street Address"]
["Suite/Unit #"]
["City"]
["State"]
["Zip Code"]
[]
[{"$f":"OrderForm!F6","v":"July"}]
["PO # (Enter Both Main and Pack Special Pos #)"]
["Ship Date (Enter Dates for Main and Pack Special Pos)"]
["Cancel date"]
["Order Total (Including Pack Special)",{"$f":"OrderForm!F3","v":{"v":0,"d":"$0.00"}}]
["Terms"]
[{"$f":"OrderForm!G6","v":"August"}]
["PO # (Enter Both Main and Pack Special Pos #)"]
["Ship Date (Enter Dates for Main and Pack Special Pos)"]
["Cancel date"]
["Order Total (Including Pack Special)",{"$f":"OrderForm!G3","v":{"v":0,"d":"$0.00"}}]
["Terms"]
[{"$f":"OrderForm!H6","v":"September"}]
["PO # (Enter Both Main and Pack Special Pos #)"]
["Ship Date (Enter Dates for Main and Pack Special Pos)"]
["Cancel date"]
["Order Total (Including Pack Special)",{"$f":"OrderForm!H3","v":{"v":0,"d":"$0.00"}}]
["Terms"]
[{"$f":"OrderForm!I6","v":"October"}]
["PO # (Enter Both Main and Pack Special Pos #)"]
["Ship Date (Enter Dates for Main and Pack Special Pos)"]
["Cancel date"]
["Order Total (Including Pack Special)",{"$f":"OrderForm!I3","v":{"v":0,"d":"$0.00"}}]
["Terms"]
[{"$f":"OrderForm!J6","v":"November"}]
["PO # (Enter Both Main and Pack Special Pos #)"]
["Ship Date (Enter Dates for Main and Pack Special Pos)"]
["Cancel date"]
["Order Total (Including Pack Special)",{"$f":"OrderForm!J3","v":{"v":0,"d":"$0.00"}}]
["Terms"]
[{"$f":"OrderForm!K6","v":"December"}]
["PO # (Enter Both Main and Pack Special Pos #)"]
["Ship Date (Enter Dates for Main and Pack Special Pos)"]
["Cancel date"]
["Order Total (Including Pack Special)",{"$f":"OrderForm!K3","v":{"v":0,"d":"$0.00"}}]
[]
["Grand Total",{"$f":"OrderForm!L3","v":0}]
["Terms",{"$f":"IF(OrderForm!L3>10000,\"8% Net 60\",IF(AND(OrderForm!L3>=5000,OrderForm!L3<=9999),\"6% Net 60\",IF(AND(OrderForm!L3>=1000,OrderForm!L3<=4999),\"4% Net 60\",\"Order Minumum Not Met\")))","v":"Order Minumum Not Met"}]

{"sheet":"OrderForm","index":2,"n_rows":168,"n_cols":243,"rows_kept":168,"merged":[[0,5,0,11],[2,1,2,2]]}
[{"$nulls":5},"Order Summary",{"$nulls":6},0]
[{"$nulls":5},{"$f":"F6&\" SHIP\"","v":"July SHIP"},{"$f":"G6&\" SHIP\"","v":"August SHIP"},"September SHIP","October SHIP","November SHIP","December SHIP","TOTAL",0]
[{"$nulls":3},"$ Totals",null,{"$f":"F167","v":{"v":0,"d":"$0.00"}},{"v":0,"d":"$0.00"},{"v":0,"d":"$0.00"},{"v":0,"d":"$0.00"},{"v":0,"d":"$0.00"},{"v":0,"d":"$0.00"},{"v":0,"d":"$0.00"},0]
[{"$nulls":12},0]
[{"$nulls":12},0]
["ITEM DESCRIPTION","COLOR","WHOLESALE ","UPC","ITEM NUMBER","July","August","September","October","November","December","WHOLESALE",0]
["LUMBAR SERIES",{"$nulls":11},0]
["CONA 4","Blackout",{"v":55,"d":"$55.00"},757894331153,"22-10000-01",{"$nulls":6},{"$f":"(F8*C8)+(G8*C8)+(H8*C8)+(I8*C8)+(J8*C8)+(K8*C8)","v":{"v":0,"d":"$0.00"}},{"$f":"IF(AND(ISBLANK(F8),ISBLANK(G8),ISBLANK(H8),ISBLANK(I8),ISBLANK(J8),ISBLANK(K8)),1,0)","v":1}]
["CONA 4","Basil",{"v":55,"d":"$55.00"},757894331405,"22-10000-77",{"$nulls":6},{"$f":"(F9*C9)+(G9*C9)+(H9*C9)+(I9*C9)+(J9*C9)+(K9*C9)","v":{"v":0,"d":"$0.00"}},{"$f":"IF(AND(ISBLANK(F9),ISBLANK(G9),ISBLANK(H9),ISBLANK(I9),ISBLANK(J9),ISBLANK(K9)),1,0)","v":1}]
["Day","Heritage Black ",{"v":49.5,"d":"$49.50"},757894330569,"20-10020-01",{"$nulls":6},{"$f":"(F10*C10)+(G10*C10)+(H10*C10)+(I10*C10)+(J10*C10)+(K10*C10)","v":{"v":0,"d":"$0.00"}},{"$f":"IF(AND(ISBLANK(F10),ISBLANK(G10),ISBLANK(H10),ISBLANK(I10),ISBLANK(J10),ISBLANK(K10)),1,0)","v":1}]
["Day","Moss Green",{"v":49.5,"d":"$49.50"},757894330576,"20-10020-54",{"$nulls":6},{"v":0,"d":"$0.00"},{"$f":"IF(AND(ISBLANK(F11),ISBLANK(G11),ISBLANK(H11),ISBLANK(I11),ISBLANK(J11),ISBLANK(K11)),1,0)","v":1}]
["Day","Rust Brown",{"v":49.5,"d":"$49.50"},757894330583,"20-10020-18",{"$nulls":6},{"v":0,"d":"$0.00"},1]
["Day","Asphalt (Grey/Blue)",{"v":49.5,"d":"$49.50"},757894330613,"20-10020-52",{"$nulls":6},{"v":0,"d":"$0.00"},1]
["Tour","Heritage Black  ",{"v":44,"d":"$44.00"},757894330507,"20-10200-01",{"$nulls":6},{"$f":"(F14*C14)+(G14*C14)+(H14*C14)+(I14*C14)+(J14*C14)+(K14*C14)","v":{"v":0,"d":"$0.00"}},{"$f":"IF(AND(ISBLANK(F14),ISBLANK(G14),ISBLANK(H14),ISBLANK(I14),ISBLANK(J14),ISBLANK(K14)),1,0)","v":1}]
["Tour","Moss Green ",{"v":44,"d":"$44.00"},757894330514,"20-10200-54",{"$nulls":6},{"v":0,"d":"$0.00"},1]
["Tour","Rust Brown",{"v":44,"d":"$44.00"},757894330521,"20-10200-18",{"$nulls":6},{"v":0,"d":"$0.00"},1]
["Tour","Asphalt Grey (Grey/Blue)",{"v":44,"d":"$44.00"},757894330552,"20-10200-52",{"$nulls":6},{"v":0,"d":"$0.00"},1]
["Tour SM","Heritage Black",{"v":41.25,"d":"$41.25"},757894330965,"20-10202-01",{"$nulls":6},{"v":0,"d":"$0.00"},1]
["Tour SM","Sage Blue",{"v":41.25,"d":"$41.25"},757894330545,"20-10202-17",{"$nulls":6},{"v":0,"d":"$0.00"},1]
["Drift","Heritage Black  ",{"v":27.5,"d":"$27.50"},757894330620,"20-10160-01",{"$nulls":6},{"v":0,"d":"$0.00"},1]
["Drift","Moss Green",{"v":27.5,"d":"$27.50"},757894330637,"20-10160-54",{"$nulls":6},{"v":0,"d":"$0.00"},1]
["Drift","Rust Brown",{"v":27.5,"d":"$27.50"},757894330644,"20-10160-18",{"$nulls":6},{"v":0,"d":"$0.00"},1]
["Drift","Sage Blue",{"v":27.5,"d":"$27.50"},757894330668,"20-10160-17",{"$nulls":6},{"v":0,"d":"$0.00"},1]
["Drift","Asphalt (Grey/Blue)",{"v":27.5,"d":"$27.50"},757894330675,"20-10160-52",{"$nulls":6},{"v":0,"d":"$0.00"},1]
["Trippin Fanny","Heritage Black",{"v":16.5,"d":"$16.50"},757894331511,"21-10301-01",{"$nulls":6},{"$f":"(F25*C25)+(G25*C25)+(H25*C25)+(I25*C25)+(J25*C25)+(K25*C25)","v":{"v":0,"d":"$0.00"}},{"$f":"IF(AND(ISBLANK(F25),ISBLANK(G25),ISBLANK(H25),ISBLANK(I25),ISBLANK(J25),ISBLANK(K25)),1,0)","v":1}]
["Trippin Fanny","Heritage Purple",{"v":16.5,"d":"$16.50"},757894331528,"21-10301-20",{"$nulls":6},{"v":0,"d":"$0.00"},1]
["Trippin Fanny","Classic Red",{"v":16.5,"d":"$16.50"},757894331535,"21-10301-31",{"$nulls":6},{"v":0,"d":"$0.00"},1]
["Trippin Fanny","Salmon",{"v":16.5,"d":"$16.50"},757894331542,"21-10301-75",{"$nulls":6},{"v":0,"d":"$0.00"},1]
["Trippin Fanny","Mint",{"v":16.5,"d":"$16.50"},757894331559,"21-10301-21",{"$nulls":6},{"v":0,"d":"$0.00"},1]
["Trippin Lil ","Heritage Black",{"v":13.75,"d":"$13.75"},757894331177,"20-10302-01",{"$nulls":6},{"$f":"(F30*C30)+(G30*C30)+(H30*C30)+(I30*C30)+(J30*C30)+(K30*C30)","v":{"v":0,"d":"$0.00"}},{"$f":"IF(AND(ISBLANK(F30),ISBLANK(G30),ISBLANK(H30),ISBLANK(I30),ISBLANK(J30),ISBLANK(K30)),1,0)","v":1}]
["Trippin Lil ","Purple Reign",{"v":13.75,"d":"$13.75"},757894331184,"20-10302-20",{"$nulls":6},{"v":0,"d":"$0.00"},1]
["Trippin Lil ","Classic Red",{"v":13.75,"d":"$13.75"},757894331191,"20-10302-31",{"$nulls":6},{"v":0,"d":"$0.00"},1]
["Trippin Lil ","Salmon",{"v":13.75,"d":"$13.75"},757894331207,"20-10302-75",{"$nulls":6},{"v":0,"d":"$0.00"},1]
["Trippin Lil ","Mint",{"v":13.75,"d":"$13.75"},757894331214,"20-10302-21",{"$nulls":6},{"v":0,"d":"$0.00"},1]
["Groove","Stone Grey ",{"v":10,"d":"$10.00"},757894330699,"20-10220-33",{"$nulls":6},{"$f":"(F35*C35)+(G35*C35)+(H35*C35)+(I35*C35)+(J35*C35)+(K35*C35)","v":{"v":0,"d":"$0.00"}},{"$f":"IF(AND(ISBLANK(F35),ISBLANK(G35),ISBLANK(H35),ISBLANK(I35),ISBLANK(J35),ISBLANK(K35)),1,0)","v":1}]
["Groove","Caribe Blue",{"v":10,"d":"$10.00"},757894330705,"20-10220-50",{"$nulls":6},{"v":0,"d":"$0.00"},1]
["Groove","Moss Green",{"v":10,"d":"$10.00"},757894330897,"20-10220-54",{"$nulls":6},{"v":0,"d":"$0.00"},1]
["Knockabout","Heritage Black  ",{"v":19.25,"d":"$19.25"},757894324506,"16-10190-01",{"$nulls":6},{"v":0,"d":"$0.00"},1]
["Knockabout","Huckleberry  ",{"v":19.25,"d":"$19.25"},757894324520,"16-10190-49",{"$nulls":6},{"v":0,"d":"$0.00"},1]
["Knockabout","Mint",{"v":19.25,"d":"$19.25"},757894327354,"16-10190-21",{"$nulls":6},{"v":0,"d":"$0.00"},1]
["Sidekick, S","Heritage Black",{"v":13.75,"d":"$13.75"},757894327316,"18-10265-01",{"$nulls":6},{"$f":"(F41*C41)+(G41*C41)+(H41*C41)+(I41*C41)+(J41*C41)+(K41*C41)","v":{"v":0,"d":"$0.00"}},{"$f":"IF(AND(ISBLANK(F41),ISBLANK(G41),ISBLANK(H41),ISBLANK(I41),ISBLANK(J41),ISBLANK(K41)),1,0)","v":1}]
["Sidekick, M","Heritage Black",{"v":15.5,"d":"$15.50"},757894327323,"18-10270-01",{"$nulls":6},{"$f":"(F42*C42)+(G42*C42)+(H42*C42)+(I42*C42)+(J42*C42)+(K42*C42)","v":{"v":0,"d":"$0.00"}},{"$f":"IF(AND(ISBLANK(F42),ISBLANK(G42),ISBLANK(H42),ISBLANK(I42),ISBLANK(J42),ISBLANK(K42)),1,0)","v":1}]
["Vibe","Heritage Black  ",{"v":16.5,"d":"$16.50"},757894324537,"16-10220-01",{"$nulls":6},{"v":0,"d":"$0.00"},1]
["Vibe","Deep Blue",{"v":16.5,"d":"$16.50"},757894326869,"16-10220-63",{"$nulls":6},{"v":0,"d":"$0.00"},1]
["Vibe","Mint  ",{"v":16.5,"d":"$16.50"},757894326838,"16-10220-21",{"$nulls":6},{"v":0,"d":"$0.00"},1]
["Dry Kick","Moss Green",{"v":27.5,"d":"$27.50"},757894328788,"19-10042-28",{"$nulls":6},{"$f":"(F46*C46)+(G46*C46)+(H46*C46)+(I46*C46)+(J46*C46)+(K46*C46)","v":{"v":0,"d":"$0.00"}},{"$f":"IF(AND(ISBLANK(F46),ISBLANK(G46),ISBLANK(H46),ISBLANK(I46),ISBLANK(J46),ISBLANK(K46)),1,0)","v":1}]
["Strapettes","Black",{"v":14,"d":"$14.00"},757894990657,"99-90004-01",{"$nulls":6},{"$f":"(F47*C47)+(G47*C47)+(H47*C47)+(I47*C47)+(J47*C47)+(K47*C47)","v":{"v":0,"d":"$0.00"}},{"$f":"IF(AND(ISBLANK(F47),ISBLANK(G47),ISBLANK(H47),ISBLANK(I47),ISBLANK(J47),ISBLANK(K47)),1,0)","v":1}]
["Day Rain Cover","Black",{"v":10,"d":"$10.00"},757894328016,"09-90015-01",{"$nulls":6},{"$f":"(F48*C48)+(G48*C48)+(H48*C48)+(I48*C48)+(J48*C48)+(K48*C48)","v":{"v":0,"d":"$0.00"}},{"$f":"IF(AND(ISBLANK(F48),ISBLANK(G48),ISBLANK(H48),ISBLANK(I48),ISBLANK(J48),ISBLANK(K48)),1,0)","v":1}]
["Tour Rain Cover","Black",{"v":9.5,"d":"$9.50"},757894328023,"09-90016-01",{"$nulls":6},{"$f":"(F49*C49)+(G49*C49)+(H49*C49)+(I49*C49)+(J49*C49)+(K49*C49)","v":{"v":0,"d":"$0.00"}},{"$f":"IF(AND(ISBLANK(F49),ISBLANK(G49),ISBLANK(H49),ISBLANK(I49),ISBLANK(J49),ISBLANK(K49)),1,0)","v":1}]
["LUMBAR SERIES SUBTOTAL",{"$nulls":4},{"$f":"SUMPRODUCT($C$8:$C$49,F8:F49)","v":{"v":0,"d":"$0.00"}},{"v":0,"d":"$0.00"},{"v":0,"d":"$0.00"},{"v":0,"d":"$0.00"},{"v":0,"d":"$0.00"},{"v":0,"d":"$0.00"},{"$f":"SUM(L8:L49)","v":{"v":0,"d":"$0.00"}},0]
["BACKPACKS",{"$nulls":11},0]
["CONA 65","Blackout",{"v":159,"d":"$159.00"},757894331122,"22-50000-01",{"$nulls":6},{"$f":"(F52*C52)+(G52*C52)+(H52*C52)+(I52*C52)+(J52*C52)+(K52*C52)","v":{"v":0,"d":"$0.00"}},1]
["CONA 45","Blackout",{"v":142,"d":"$142.00"},"757894331139","22-50010-01",{"$nulls":6},{"v":0,"d":"$0.00"},1]
["CONA 45","Basil",{"v":142,"d":"$142.00"},757894331382,"22-50010-77",{"$nulls":6},{"v":0,"d":"$0.00"},1]
["CONA 25","Blackout",{"v":83,"d":"$83.00"},"757894331146","22-50020-01",{"$nulls":6},{"$f":"(F55*C55)+(G55*C55)+(H55*C55)+(I55*C55)+(J55*C55)+(K55*C55)","v":{"v":0,"d":"$0.00"}},{"$f":"IF(AND(ISBLANK(F55),ISBLANK(G55),ISBLANK(H55),ISBLANK(I55),ISBLANK(J55),ISBLANK(K55)),1,0)","v":1}]
["CONA 25","Basil",{"v":83,"d":"$83.00"},757894331399,"22-50020-77",{"$nulls":6},{"v":0,"d":"$0.00"},1]
["Zerk 40 ","Phantom",{"v":122,"d":"$122.00"},757894331580,"21-50441-44",{"$nulls":6},{"$f":"(F57*C57)+(G57*C57)+(H57*C57)+(I57*C57)+(J57*C57)+(K57*C57)","v":{"v":0,"d":"$0.00"}},{"$f":"IF(AND(ISBLANK(F57),ISBLANK(G57),ISBLANK(H57),ISBLANK(I57),ISBLANK(J57),ISBLANK(K57)),1,0)","v":1}]
["Scream 55","Phantom",{"v":88,"d":"$88.00"},757894331368,"22-50240-44",{"$nulls":6},{"v":0,"d":"$0.00"},1]
["Scream 55","Smoke Blue",{"v":88,"d":"$88.00"},757894331696,"22-50240-74",{"$nulls":6},{"v":0,"d":"$0.00"},1]
["Scream 30","Phantom",{"v":66,"d":"$66.00"},"757894331832","22-50250-44",{"$nulls":6},{"v":0,"d":"$0.00"},1]
["Scream 30","Smoke Blue",{"v":66,"d":"$66.00"},757894331849,"22-50250-74",{"$nulls":6},{"v":0,"d":"$0.00"},1]
["Scream 12 ","Phantom",{"v":49.5,"d":"$49.50"},757894331917,"22-50251-44",{"$nulls":6},{"v":0,"d":"$0.00"},1]
["Scream 12 ","Smoke Blue",{"v":49.5,"d":"$49.50"},757894331924,"22-50251-74",{"$nulls":6},{"v":0,"d":"$0.00"},1]
["Apex 80 ","Phantom",{"v":138,"d":"$138.00"},757894331504,"22-50180-44",{"$nulls":6},{"v":0,"d":"$0.00"},1]
["Apex 60 ","Phantom",{"v":122,"d":"$122.00"},757894331406,"22-50160-44",{"$nulls":6},{"v":0,"d":"$0.00"},1]
["Apex 60 ","Smoke Blue",{"v":122,"d":"$122.00"},757894331498,"22-50160-74",{"$nulls":6},{"v":0,"d":"$0.00"},1]
["Apex 25","Phantom",{"v":71,"d":"$71.00"},"757894331870","22-50161-44",{"$nulls":6},{"v":0,"d":"$0.00"},1]
["Apex 25 ","Smoke Blue",{"v":71,"d":"$71.00"},"757894331887","22-50161-74",{"$nulls":6},{"v":0,"d":"$0.00"},1]
["Apex 20 ","Phantom",{"v":61,"d":"$61.00"},757894331894,"22-50162-44",{"$nulls":6},{"v":0,"d":"$0.00"},1]
["Apex 20","Smoke Blue",{"v":61,"d":"$61.00"},"757894331900","22-50162-74",{"$nulls":6},{"v":0,"d":"$0.00"},1]
["Mayhem 45","Heitage Black",{"v":99,"d":"$99.00"},757894328542,"19-50301-01",{"$nulls":6},{"$f":"(F71*C71)+(G71*C71)+(H71*C71)+(I71*C71)+(J71*C71)+(K71*C71)","v":{"v":0,"d":"$0.00"}},{"$f":"IF(AND(ISBLANK(F71),ISBLANK(G71),ISBLANK(H71),ISBLANK(I71),ISBLANK(J71),ISBLANK(K71)),1,0)","v":1}]
["Mayhem 30","Heritage Black",{"v":88,"d":"$88.00"},757894328566,"19-50311-01",{"$nulls":6},{"v":0,"d":"$0.00"},1]
["Tanuck 40","Heritage Black",{"v":126.5,"d":"$126.50"},757894326142,"17-81400-01",{"$nulls":6},{"$f":"(F73*C73)+(G73*C73)+(H73*C73)+(I73*C73)+(J73*C73)+(K73*C73)","v":{"v":0,"d":"$0.00"}},{"$f":"IF(AND(ISBLANK(F73),ISBLANK(G73),ISBLANK(H73),ISBLANK(I73),ISBLANK(J73),ISBLANK(K73)),1,0)","v":1}]
["Tanack 10","Heritage Black",{"v":55,"d":"$55.00"},757894326197,"17-81450-01",{"$nulls":6},{"$f":"(F74*C74)+(G74*C74)+(H74*C74)+(I74*C74)+(J74*C74)+(K74*C74)","v":{"v":0,"d":"$0.00"}},{"$f":"IF(AND(ISBLANK(F74),ISBLANK(G74),ISBLANK(H74),ISBLANK(I74),ISBLANK(J74),ISBLANK(K74)),1,0)","v":1}]
["Kit Cube Small","Heritage Black",{"v":27.5,"d":"$27.50"},757894326111,"17-81330-01",{"$nulls":6},{"v":0,"d":"$0.00"},1]
["Kit Cube Medium","Heritage Black",{"v":33,"d":"$33.00"},757894326128,"17-81340-01",{"$nulls":6},{"v":0,"d":"$0.00"},1]
["Kit Cube Large","Heritage Black",{"v":38.5,"d":"$38.50"},757894326135,"17-81350-01",{"$nulls":6},{"$f":"(F77*C77)+(G77*C77)+(H77*C77)+(I77*C77)+(J77*C77)+(K77*C77)","v":{"v":0,"d":"$0.00"}},{"$f":"IF(AND(ISBLANK(F77),ISBLANK(G77),ISBLANK(H77),ISBLANK(I77),ISBLANK(J77),ISBLANK(K77)),1,0)","v":1}]
["Amble","Navy",{"v":44,"d":"$44.00"},757894331344,"21-75353-48",{"$nulls":6},{"$f":"(F78*C78)+(G78*C78)+(H78*C78)+(I78*C78)+(J78*C78)+(K78*C78)","v":{"v":0,"d":"$0.00"}},{"$f":"IF(AND(ISBLANK(F78),ISBLANK(G78),ISBLANK(H78),ISBLANK(I78),ISBLANK(J78),ISBLANK(K78)),1,0)","v":1}]
["Amble","Basil",{"v":44,"d":"$44.00"},757894331740,"21-75353-77",{"$nulls":6},{"v":0,"d":"$0.00"},1]
["Divide","Blackout",{"v":49.5,"d":"$49.50"},757894331351,"21-75350-01",{"$nulls":6},{"$f":"(F80*C80)+(G80*C80)+(H80*C80)+(I80*C80)+(J80*C80)+(K80*C80)","v":{"v":0,"d":"$0.00"}},{"$f":"IF(AND(ISBLANK(F80),ISBLANK(G80),ISBLANK(H80),ISBLANK(I80),ISBLANK(J80),ISBLANK(K80)),1,0)","v":1}]
["Divide","Basil",{"v":49.5,"d":"$49.50"},757894331719,"21-75350-77",{"$nulls":6},{"$f":"(F81*C81)+(G81*C81)+(H81*C81)+(I81*C81)+(J81*C81)+(K81*C81)","v":{"v":0,"d":"$0.00"}},{"$f":"IF(AND(ISBLANK(F81),ISBLANK(G81),ISBLANK(H81),ISBLANK(I81),ISBLANK(J81),ISBLANK(K81)),1,0)","v":1}]
["Trippin Pack","Heritage Black",{"v":33,"d":"$33.00"},757894331603,"21-10401-01",{"$nulls":6},{"$f":"(F82*C82)+(G82*C82)+(H82*C82)+(I82*C82)+(J82*C82)+(K82*C82)","v":{"v":0,"d":"$0.00"}},{"$f":"IF(AND(ISBLANK(F82),ISBLANK(G82),ISBLANK(H82),ISBLANK(I82),ISBLANK(J82),ISBLANK(K82)),1,0)","v":1}]
["Trippin Pack","Heritage Purple",{"v":33,"d":"$33.00"},"757894331610","21-10401-20",{"$nulls":6},{"$f":"(F83*C83)+(G83*C83)+(H83*C83)+(I83*C83)+(J83*C83)+(K83*C83)","v":{"v":0,"d":"$0.00"}},{"$f":"IF(AND(ISBLANK(F83),ISBLANK(G83),ISBLANK(H83),ISBLANK(I83),ISBLANK(J83),ISBLANK(K83)),1,0)","v":1}]
["Trippin Pack","Classic Red",{"v":33,"d":"$33.00"},"757894331627","21-10401-31",{"$nulls":6},{"$f":"(F84*C84)+(G84*C84)+(H84*C84)+(I84*C84)+(J84*C84)+(K84*C84)","v":{"v":0,"d":"$0.00"}},{"$f":"IF(AND(ISBLANK(F84),ISBLANK(G84),ISBLANK(H84),ISBLANK(I84),ISBLANK(J84),ISBLANK(K84)),1,0)","v":1}]
["Trippin Pack","Salmon",{"v":33,"d":"$33.00"},"757894331634","21-10401-75",{"$nulls":6},{"v":0,"d":"$0.00"},1]
["Trippin Pack","Mint",{"v":33,"d":"$33.00"},"757894331641","21-10401-21",{"$nulls":6},{"$f":"(F86*C86)+(G86*C86)+(H86*C86)+(I86*C86)+(J86*C86)+(K86*C86)","v":{"v":0,"d":"$0.00"}},{"$f":"IF(AND(ISBLANK(F86),ISBLANK(G86),ISBLANK(H86),ISBLANK(I86),ISBLANK(J86),ISBLANK(K86)),1,0)","v":1}]
["Trippin Pouch","Heritage Black",{"v":13.75,"d":"$13.75"},"757894331771","21-10201-01",{"$nulls":6},{"$f":"(F87*C87)+(G87*C87)+(H87*C87)+(I87*C87)+(J87*C87)+(K87*C87)","v":{"v":0,"d":"$0.00"}},{"$f":"IF(AND(ISBLANK(F87),ISBLANK(G87),ISBLANK(H87),ISBLANK(I87),ISBLANK(J87),ISBLANK(K87)),1,0)","v":1}]
["Trippin Pouch","Heritage Purple",{"v":13.75,"d":"$13.75"},"757894331788","21-10201-20",{"$nulls":6},{"$f":"(F88*C88)+(G88*C88)+(H88*C88)+(I88*C88)+(J88*C88)+(K88*C88)","v":{"v":0,"d":"$0.00"}},{"$f":"IF(AND(ISBLANK(F88),ISBLANK(G88),ISBLANK(H88),ISBLANK(I88),ISBLANK(J88),ISBLANK(K88)),1,0)","v":1}]
["Trippin Pouch","Classic Red",{"v":13.75,"d":"$13.75"},"757894331795","21-10201-31",{"$nulls":6},{"$f":"(F89*C89)+(G89*C89)+(H89*C89)+(I89*C89)+(J89*C89)+(K89*C89)","v":{"v":0,"d":"$0.00"}},{"$f":"IF(AND(ISBLANK(F89),ISBLANK(G89),ISBLANK(H89),ISBLANK(I89),ISBLANK(J89),ISBLANK(K89)),1,0)","v":1}]
["Trippin Pouch","Salmon",{"v":13.75,"d":"$13.75"},"757894331801","21-10201-75",{"$nulls":6},{"v":0,"d":"$0.00"},1]
["Trippin Pouch","Mint",{"v":13.75,"d":"$13.75"},"757894331818","21-10201-21",{"$nulls":6},{"$f":"(F91*C91)+(G91*C91)+(H91*C91)+(I91*C91)+(J91*C91)+(K91*C91)","v":{"v":0,"d":"$0.00"}},{"$f":"IF(AND(ISBLANK(F91),ISBLANK(G91),ISBLANK(H91),ISBLANK(I91),ISBLANK(J91),ISBLANK(K91)),1,0)","v":1}]
["Adventure Office","Heritage Black ",{"v":44,"d":"$44.00"},757894327590,"18-75311-01",{"$nulls":6},{"$f":"(F92*C92)+(G92*C92)+(H92*C92)+(I92*C92)+(J92*C92)+(K92*C92)","v":{"v":0,"d":"$0.00"}},{"$f":"IF(AND(ISBLANK(F92),ISBLANK(G92),ISBLANK(H92),ISBLANK(I92),ISBLANK(J92),ISBLANK(K92)),1,0)","v":1}]
["Adventure Office Small","Heritage Black",{"v":33,"d":"$33.00"},757894325510,"16-75300-01",{"$nulls":6},{"$f":"(F93*C93)+(G93*C93)+(H93*C93)+(I93*C93)+(J93*C93)+(K93*C93)","v":{"v":0,"d":"$0.00"}},{"$f":"IF(AND(ISBLANK(F93),ISBLANK(G93),ISBLANK(H93),ISBLANK(I93),ISBLANK(J93),ISBLANK(K93)),1,0)","v":1}]
["Rain Cover Extra Small","Black",{"v":10,"d":"$10.00"},757894314811,"07-90010-01",{"$nulls":6},{"v":0,"d":"$0.00"},1]
["Rain Cover Small","Black",{"v":11,"d":"$11.00"},757894990725,"07-90011-01",{"$nulls":6},{"v":0,"d":"$0.00"},1]
["Rain Cover Medium","Black",{"v":12,"d":"$12.00"},757894990732,"07-90012-01",{"$nulls":6},{"v":0,"d":"$0.00"},1]
["Rain Cover Large","Black",{"v":13,"d":"$13.00"},757894990749,"07-90013-01",{"$nulls":6},{"v":0,"d":"$0.00"},1]
["BACKPACKS SUBTOTAL",{"$nulls":4},{"$f":"SUMPRODUCT($C$52:$C$97,F52:F97)","v":{"v":0,"d":"$0.00"}},{"v":0,"d":"$0.00"},{"v":0,"d":"$0.00"},{"v":0,"d":"$0.00"},{"v":0,"d":"$0.00"},{"v":0,"d":"$0.00"},{"$f":"SUM(L52:L97)","v":{"v":0,"d":"$0.00"}},0]
["TREKKING POLES",{"$nulls":11},0]
["Andesite","Carbon ",{"v":50,"d":"$50.00"},757894330026,"19-9100-01",{"$nulls":6},{"$f":"(F100*C100)+(G100*C100)+(H100*C100)+(I100*C100)+(J100*C100)+(K100*C100)","v":{"v":0,"d":"$0.00"}},{"$f":"IF(AND(ISBLANK(F100),ISBLANK(G100),ISBLANK(H100),ISBLANK(I100),ISBLANK(J100),ISBLANK(K100)),1,0)","v":1}]
["Halite 7075 ","Moroccan Blue ",{"v":40,"d":"$40.00"},757894329433,"19-9732-30",{"$nulls":6},{"v":0,"d":"$0.00"},1]
["Halite WSD 7075","Capri Blue ",{"v":40,"d":"$40.00"},757894329440,"19-9732-26",{"$nulls":6},{"v":0,"d":"$0.00"},1]
["Carbonlite Pro","Carbon  ",{"v":40,"d":"$40.00"},757894328696,"19-9622-01",{"$nulls":6},{"v":0,"d":"$0.00"},1]
["Tellurite 7075 OLS","Burnt Ochre",{"v":32.5,"d":"$32.50"},757894329464,"19-9752-06",{"$nulls":6},{"v":0,"d":"$0.00"},1]
["Tellurite WSD 7075","Berry ",{"v":32.5,"d":"$32.50"},757894329471,"19-9752-19",{"$nulls":6},{"v":0,"d":"$0.00"},1]
["Pyrite 7075","Lava Red",{"v":30,"d":"$30.00"},757894328689,"19-9612-02",{"$nulls":6},{"v":0,"d":"$0.00"},1]
["Rhyolite 6061","Deep Blue",{"v":20,"d":"$20.00"},757894328672,"19-9602-63",{"$nulls":6},{"v":0,"d":"$0.00"},1]
["Trekker FX Lite","Carbon",{"v":20,"d":"$20.00"},757894328733,"19-9701-01",{"$nulls":6},{"v":0,"d":"$0.00"},1]
["Globetrotter","Graphite ",{"v":19,"d":"$19.00"},757894329457,"19-9741-08",{"$nulls":6},{"v":0,"d":"$0.00"},1]
["Dolomite 7075 OLS","Moroccan Blue ",{"v":15,"d":"$15.00"},757894329426,"19-9711-30",{"$nulls":6},{"v":0,"d":"$0.00"},1]
["Pinnacle Single","Sand",{"v":10,"d":"$10.00"},757894328702,"19-9651-14",{"$nulls":6},{"v":0,"d":"$0.00"},1]
["Pinnacle Single","Glacier Blue",{"v":10,"d":"$10.00"},757894328719,"19-9651-39",{"$nulls":6},{"v":0,"d":"$0.00"},1]
["SlingBack Chair","Anvil Grey",{"v":12.5,"d":"$12.50"},757894326210,"17-9490-65",{"$nulls":6},{"v":0,"d":"$0.00"},1]
["Snow Baskets (Pair)",null,{"v":3,"d":"$3.00"},757894325299,"15-9470-01",{"$nulls":6},{"v":0,"d":"$0.00"},1]
["Hiking Baskets (Pair)",null,{"v":3,"d":"$3.00"},757894325893,"17-9480-01",{"$nulls":6},{"v":0,"d":"$0.00"},1]
["Trekking Pole Nordic Boot Tips (Pair)",null,{"v":4,"d":"$4.00"},757894325909,"17-9501-01",{"$nulls":6},{"v":0,"d":"$0.00"},1]
["Trekking Pole Rubber Boot Tips (Pair)",null,{"v":3,"d":"$3.00"},757894321789,"12-9500-01",{"$nulls":6},{"v":0,"d":"$0.00"},1]
["Hiking Baskets Bulk (20pcs)",null,{"v":20,"d":"$20.00"},757894326333,"17-9489-01",{"$nulls":6},{"v":0,"d":"$0.00"},1]
["Snow Baskets Bulk (20pcs)",null,{"v":20,"d":"$20.00"},757894326340,"17-9479-01",{"$nulls":6},{"v":0,"d":"$0.00"},1]
["Rubber Boot Tips Bulk (20pcs)",null,{"v":20,"d":"$20.00"},757894326357,"17-9509-01",{"$nulls":6},{"v":0,"d":"$0.00"},1]
{"$rows_left_out":48}